VASP安装出错,请问大佬fpp命令未找到是什么原因啊
VASP安装出错,请问大佬下面的出错原因是什么啊
if [ ! -d build/std ] ; then mkdir build/std ; fi; \
cp src/makefile src/.objects makefile.include build/std ; \
make -C build/std VERSION=std all
make[1]: 进入目录“/opt/vasp/vasp.6.1.2_patched/build/std”
rsync -ru ../../src/lib .
cp makefile.include lib
make -C lib -j1
make[2]: 进入目录“/opt/vasp/vasp.6.1.2_patched/build/std/lib”
make libdmy.a
make[3]: 进入目录“/opt/vasp/vasp.6.1.2_patched/build/std/lib”
fpp -f_com=no -free -w0 preclib.F preclib.f90
make[3]:fpp:命令未找到
make[3]: *** [makefile:25:preclib.f90] 错误 127
make[3]: 离开目录“/opt/vasp/vasp.6.1.2_patched/build/std/lib”
make[2]: *** [makefile:18:all] 错误 2
make[2]: 离开目录“/opt/vasp/vasp.6.1.2_patched/build/std/lib”
make[1]: *** [makefile:156:lib] 错误 2
make[1]: 离开目录“/opt/vasp/vasp.6.1.2_patched/build/std”
make: *** [makefile:6:std] 错误 2
返回小木虫查看更多
京公网安备 11010802022153号
谢谢解答,他们的安装位置不一样的话是好几个PATH吗?
PATH=ifort:$PATH
PATH=mpi:$PATH
PATH=mkl:$PATH
这样的吗?
内容已删除
问题解决了,我在vasp6.1.2文件夹下运行root终端,添加环境变量,make可以继续进行没有错误了
编译器,并行库,数学库,按Makefile中路径挂对,可直接make轻松通过
楼主问题解决了吗,我也是ONEAPI,也是这个问题,vasp6.1.0
您好,我遇到同样的问题了,您添加的哪些环境变量�
,