| 查看: 1778 | 回复: 5 | |||
[交流]
【求助】delphi运行一个书本程序,运行不起来
|
|
我建立了两个FORM,把他们放在一个工程内部,但是运行出现错误,其中unit1.pas的源代码是: unit2的源代码是: 但是编译工程会出现错误: Build started 2010-11-22 23:46:19. __________________________________________________ Project "C:\Documents and Settings\Administrator\My Documents\RAD Studio\Projects\Project1.dproj" (Make target(s)): Target CoreCompile: c:\program files\embarcadero\rad studio\7.0\bin\dcc32.exe --no-config -M -Q -AWinTypes=Windows;WinProcs=Windows;DbiTypes=BDE;DbiProcs=BDE;DbiErrs=BDE -DDEBUG -I"c:\program files\embarcadero\rad studio\7.0\lib";"C:\Documents and Settings\Administrator\My Documents\RAD Studio\7.0\Imports";"c:\program files\embarcadero\rad studio\7.0\Imports";"c:\program files\embarcadero\rad studio\7.0\Lib\Indy10";"C:\Documents and Settings\All Users\Documents\RAD Studio\7.0\Dcp";"c:\program files\embarcadero\rad studio\7.0\include";"c:\program files\embarcadero\rad studio\7.0\RaveReports\Lib" -LE"C:\Documents and Settings\All Users\Documents\RAD Studio\7.0\Bpl" -LN"C:\Documents and Settings\All Users\Documents\RAD Studio\7.0\Dcp" -NB"C:\Documents and Settings\All Users\Documents\RAD Studio\7.0\Dcp" -O"c:\program files\embarcadero\rad studio\7.0\lib";"C:\Documents and Settings\Administrator\My Documents\RAD Studio\7.0\Imports";"c:\program files\embarcadero\rad studio\7.0\Imports";"c:\program files\embarcadero\rad studio\7.0\Lib\Indy10";"C:\Documents and Settings\All Users\Documents\RAD Studio\7.0\Dcp";"c:\program files\embarcadero\rad studio\7.0\include";"c:\program files\embarcadero\rad studio\7.0\RaveReports\Lib" -R"c:\program files\embarcadero\rad studio\7.0\lib";"C:\Documents and Settings\Administrator\My Documents\RAD Studio\7.0\Imports";"c:\program files\embarcadero\rad studio\7.0\Imports";"c:\program files\embarcadero\rad studio\7.0\Lib\Indy10";"C:\Documents and Settings\All Users\Documents\RAD Studio\7.0\Dcp";"c:\program files\embarcadero\rad studio\7.0\include";"c:\program files\embarcadero\rad studio\7.0\RaveReports\Lib" -U"c:\program files\embarcadero\rad studio\7.0\lib";"C:\Documents and Settings\Administrator\My Documents\RAD Studio\7.0\Imports";"c:\program files\embarcadero\rad studio\7.0\Imports";"c:\program files\embarcadero\rad studio\7.0\Lib\Indy10";"C:\Documents and Settings\All Users\Documents\RAD Studio\7.0\Dcp";"c:\program files\embarcadero\rad studio\7.0\include";"c:\program files\embarcadero\rad studio\7.0\RaveReports\Lib" -K00400000 -NO"C:\Documents and Settings\All Users\Documents\RAD Studio\7.0\Dcp" Project1.dpr C:\Documents and Settings\Administrator\桌面\Unit2.pas(31,3): error E2003: E2003 Undeclared identifier: 'MemShowInfo' C:\Documents and Settings\Administrator\桌面\Unit2.pas(31,15): error E2066: E2066 Missing operator or semicolon C:\Documents and Settings\Administrator\桌面\Unit2.pas(33,24): error E2003: E2003 Undeclared identifier: 'formInfoInput' C:\Documents and Settings\Administrator\桌面\Unit2.pas(33,38): warning W1058: W1058 Implicit string cast with potential data loss from 'string' to 'ShortString' C:\Documents and Settings\Administrator\桌面\Unit2.pas(33,38): error E2066: E2066 Missing operator or semicolon C:\Documents and Settings\Administrator\桌面\Unit2.pas(35,48): warning W1058: W1058 Implicit string cast with potential data loss from 'string' to 'ShortString' C:\Documents and Settings\Administrator\桌面\Unit2.pas(35,48): error E2066: E2066 Missing operator or semicolon C:\Documents and Settings\Administrator\桌面\Unit2.pas(35,67): error E2014: E2014 Statement expected, but expression of type 'TCaption' found C:\Documents and Settings\Administrator\桌面\Unit2.pas(36,48): warning W1058: W1058 Implicit string cast with potential data loss from 'string' to 'ShortString' C:\Documents and Settings\Administrator\桌面\Unit2.pas(36,48): error E2066: E2066 Missing operator or semicolon C:\Documents and Settings\Administrator\桌面\Unit2.pas(36,68): error E2014: E2014 Statement expected, but expression of type 'TCaption' found C:\Documents and Settings\Administrator\桌面\Unit2.pas(37,48): warning W1058: W1058 Implicit string cast with potential data loss from 'string' to 'ShortString' C:\Documents and Settings\Administrator\桌面\Unit2.pas(37,48): error E2066: E2066 Missing operator or semicolon C:\Documents and Settings\Administrator\桌面\Unit2.pas(37,69): error E2014: E2014 Statement expected, but expression of type 'TCaption' found C:\Documents and Settings\Administrator\桌面\Unit2.pas(38,48): warning W1058: W1058 Implicit string cast with potential data loss from 'string' to 'ShortString' C:\Documents and Settings\Administrator\桌面\Unit2.pas(38,48): error E2066: E2066 Missing operator or semicolon C:\Documents and Settings\Administrator\桌面\Unit2.pas(38,69): error E2014: E2014 Statement expected, but expression of type 'TCaption' found C:\Documents and Settings\Administrator\桌面\Unit2.pas(39,48): warning W1058: W1058 Implicit string cast with potential data loss from 'string' to 'ShortString' C:\Documents and Settings\Administrator\桌面\Unit2.pas(39,48): error E2066: E2066 Missing operator or semicolon C:\Documents and Settings\Administrator\桌面\Unit2.pas(39,60): error E2066: E2066 Missing operator or semicolon C:\Documents and Settings\Administrator\桌面\Unit2.pas(39,72): error E2014: E2014 Statement expected, but expression of type 'TCaption' found C:\Documents and Settings\Administrator\桌面\Unit2.pas(40,15): error E2066: E2066 Missing operator or semicolon C:\Documents and Settings\Administrator\桌面\Unit2.pas(42,25): error E2003: E2003 Undeclared identifier: 'btnQuitClick' C:\Documents and Settings\Administrator\桌面\Unit2.pas(42,37): error E2029: E2029 ';' expected but '(' found C:\Documents and Settings\Administrator\桌面\Unit1.pas(39): error F2063: F2063 Could not compile used unit '..\..\..\桌面\Unit2.pas' Done building target "CoreCompile" in project "Project1.dproj" -- FAILED. Done building project "Project1.dproj" -- FAILED. Build FAILED. C:\Documents and Settings\Administrator\桌面\Unit2.pas(33,38): warning W1058: W1058 Implicit string cast with potential data loss from 'string' to 'ShortString' C:\Documents and Settings\Administrator\桌面\Unit2.pas(35,48): warning W1058: W1058 Implicit string cast with potential data loss from 'string' to 'ShortString' C:\Documents and Settings\Administrator\桌面\Unit2.pas(36,48): warning W1058: W1058 Implicit string cast with potential data loss from 'string' to 'ShortString' C:\Documents and Settings\Administrator\桌面\Unit2.pas(37,48): warning W1058: W1058 Implicit string cast with potential data loss from 'string' to 'ShortString' C:\Documents and Settings\Administrator\桌面\Unit2.pas(38,48): warning W1058: W1058 Implicit string cast with potential data loss from 'string' to 'ShortString' C:\Documents and Settings\Administrator\桌面\Unit2.pas(39,48): warning W1058: W1058 Implicit string cast with potential data loss from 'string' to 'ShortString' C:\Documents and Settings\Administrator\桌面\Unit2.pas(31,3): error E2003: E2003 Undeclared identifier: 'MemShowInfo' C:\Documents and Settings\Administrator\桌面\Unit2.pas(31,15): error E2066: E2066 Missing operator or semicolon C:\Documents and Settings\Administrator\桌面\Unit2.pas(33,24): error E2003: E2003 Undeclared identifier: 'formInfoInput' C:\Documents and Settings\Administrator\桌面\Unit2.pas(33,38): error E2066: E2066 Missing operator or semicolon C:\Documents and Settings\Administrator\桌面\Unit2.pas(35,48): error E2066: E2066 Missing operator or semicolon C:\Documents and Settings\Administrator\桌面\Unit2.pas(35,67): error E2014: E2014 Statement expected, but expression of type 'TCaption' found C:\Documents and Settings\Administrator\桌面\Unit2.pas(36,48): error E2066: E2066 Missing operator or semicolon C:\Documents and Settings\Administrator\桌面\Unit2.pas(36,68): error E2014: E2014 Statement expected, but expression of type 'TCaption' found C:\Documents and Settings\Administrator\桌面\Unit2.pas(37,48): error E2066: E2066 Missing operator or semicolon C:\Documents and Settings\Administrator\桌面\Unit2.pas(37,69): error E2014: E2014 Statement expected, but expression of type 'TCaption' found C:\Documents and Settings\Administrator\桌面\Unit2.pas(38,48): error E2066: E2066 Missing operator or semicolon C:\Documents and Settings\Administrator\桌面\Unit2.pas(38,69): error E2014: E2014 Statement expected, but expression of type 'TCaption' found C:\Documents and Settings\Administrator\桌面\Unit2.pas(39,48): error E2066: E2066 Missing operator or semicolon C:\Documents and Settings\Administrator\桌面\Unit2.pas(39,60): error E2066: E2066 Missing operator or semicolon C:\Documents and Settings\Administrator\桌面\Unit2.pas(39,72): error E2014: E2014 Statement expected, but expression of type 'TCaption' found C:\Documents and Settings\Administrator\桌面\Unit2.pas(40,15): error E2066: E2066 Missing operator or semicolon C:\Documents and Settings\Administrator\桌面\Unit2.pas(42,25): error E2003: E2003 Undeclared identifier: 'btnQuitClick' C:\Documents and Settings\Administrator\桌面\Unit2.pas(42,37): error E2029: E2029 ';' expected but '(' found C:\Documents and Settings\Administrator\桌面\Unit1.pas(39): error F2063: F2063 Could not compile used unit '..\..\..\桌面\Unit2.pas' 6 Warning(s) 19 Error(s) Time Elapsed 00:00:00.37 |
» 猜你喜欢
售SCI一区T0P文章,我:8O.55.1.O.5.4,科目齐全,可+急
已经有5人回复
售SCI-T0P文章,我:8O.5.5.1.O.54,科目齐全,可+急
已经有7人回复
上海工程技术大学 激光智能制造课题组 2027级博士研究生招生
已经有6人回复
课题组招2027级博士 上海工程技术大学 激光智能制造方向
已经有6人回复
现代”学阀”该如何界定
已经有14人回复
求合成方法
已经有8人回复
师弟论文见刊大半年才想起来申请专利,还能抢救一下吗?
已经有4人回复
有机合成以后会不会被AI改变?做科研的虫友怎么看
已经有8人回复
我的奶奶
已经有3人回复
» 本主题相关价值贴推荐,对您同样有帮助:
MC一个简单的程序,运行不了,哪位大侠帮看看怎么回事。多谢!
已经有7人回复
运行结果为0,怎么回事?
已经有5人回复
运行一个python程序,出现问题,请高手赐教
已经有9人回复
同样的MATLAB程序,为何在别人的电脑上运行不了
已经有21人回复
用opengl做了个工程,编译无错误,但是运行不起来。。。
已经有11人回复
【转帖】delphi语法进阶
已经有3人回复
【转帖】用Delphi开发视频聊天软件
已经有8人回复
【求助】运行ms的时候跳出“由于另一个程序正在运行中,此操作无法完成。请选择切换…
已经有28人回复
【求助】此程序没有错误,怎么运行不出来?
已经有6人回复
【分享】一个Delphi的源码加密插件
已经有4人回复
【求助】为什么我编译了一个书本上的无错误的C++程序,却有这么多的错误?
已经有8人回复
【求助】此VB程序怎么运行不起来?
已经有8人回复
【求助】Fortran程序,如何让exe文件可以单独运行?
已经有6人回复
【求助】安装ansys时,运行Keygen程序,但不会自动生成一个文件License.dat,为什么?
已经有12人回复
» 抢金币啦!回帖就可以得到:
坐标无锡,诚征女友
+3/964
2026年材料结构与力学性能国际会议(MSMP 2026
+1/926
2026年物理学、化学与数据分析国际会议 (PCDA 2026)
+1/894
2027年航天航空、材料与人工智能国际会议(AMAI 2027)
+1/870
2027年电气工程、自动化与应用工程国际会议(EEAE 2027)
+1/852
2027年生物医学、农业与可持续发展国际会议(BASD 2027)
+1/830
2027年计算机视觉、设计与非遗文化传播国际会议(CVDC 2027)
+1/804
持续创业者,A8离异男征婚,事业遇到瓶颈,寻找生活伴侣
+1/294
石河子大学能源与材料学院李航副教授课题组招收硕、博士
+1/98
石河子大学能源与材料学院李航副教授课题组招收硕、博士
+1/87
南科大薛亚辉课题组诚聘离子输运、二维材料、原子力显微镜等方向“快响行动”博士生
+1/86
南方科技大学力航系急招收纳米材料、力学、机械等方向推免硕士研究生两名
+1/80
上海遇见缘分
+5/75
澳门大学孙鹏展博士课题组招收全奖博士研究生1名
+2/74
【2027硕士招生】招收材料、化工、环境、冶金类硕士研究生
+1/24
废油资源化教育部工程中心 诚聘催化方向特聘研究员
+1/10
大湾区大学姚瑶课题组2027届博士生招生 (与中山大学联合培养)
+1/6
澳门大学光电方向招收博士研究生
+1/5
(香港大学)智能制造实验室招收27年春秋季入学全奖博士和硕士研究生
+1/5
CAR表达怎么测?定点荧光标记蛋白让流式细胞检测更直接
+1/1
2楼2010-11-22 23:57:28
3楼2010-11-22 23:58:08
4楼2012-04-09 09:11:50
5楼2012-06-30 01:15:05
6楼2013-06-30 10:08:20










回复此楼
