| 查看: 1793 | 回复: 5 | |||
[交流]
【求助】delphi运行一个书本程序,运行不起来
|
|
我建立了两个FORM,把他们放在一个工程内部,但是运行出现错误,其中unit1.pas的源代码是: unit2的源代码是: 但是编译工程会出现错误: Build started 2010-11-22 23:46:19. __________________________________________________ Project "C:\Documents and Settings\Administrator\My Documents\RAD Studio\Projects\Project1.dproj" (Make target(s)): Target CoreCompile: c:\program files\embarcadero\rad studio\7.0\bin\dcc32.exe --no-config -M -Q -AWinTypes=Windows;WinProcs=Windows;DbiTypes=BDE;DbiProcs=BDE;DbiErrs=BDE -DDEBUG -I"c:\program files\embarcadero\rad studio\7.0\lib";"C:\Documents and Settings\Administrator\My Documents\RAD Studio\7.0\Imports";"c:\program files\embarcadero\rad studio\7.0\Imports";"c:\program files\embarcadero\rad studio\7.0\Lib\Indy10";"C:\Documents and Settings\All Users\Documents\RAD Studio\7.0\Dcp";"c:\program files\embarcadero\rad studio\7.0\include";"c:\program files\embarcadero\rad studio\7.0\RaveReports\Lib" -LE"C:\Documents and Settings\All Users\Documents\RAD Studio\7.0\Bpl" -LN"C:\Documents and Settings\All Users\Documents\RAD Studio\7.0\Dcp" -NB"C:\Documents and Settings\All Users\Documents\RAD Studio\7.0\Dcp" -O"c:\program files\embarcadero\rad studio\7.0\lib";"C:\Documents and Settings\Administrator\My Documents\RAD Studio\7.0\Imports";"c:\program files\embarcadero\rad studio\7.0\Imports";"c:\program files\embarcadero\rad studio\7.0\Lib\Indy10";"C:\Documents and Settings\All Users\Documents\RAD Studio\7.0\Dcp";"c:\program files\embarcadero\rad studio\7.0\include";"c:\program files\embarcadero\rad studio\7.0\RaveReports\Lib" -R"c:\program files\embarcadero\rad studio\7.0\lib";"C:\Documents and Settings\Administrator\My Documents\RAD Studio\7.0\Imports";"c:\program files\embarcadero\rad studio\7.0\Imports";"c:\program files\embarcadero\rad studio\7.0\Lib\Indy10";"C:\Documents and Settings\All Users\Documents\RAD Studio\7.0\Dcp";"c:\program files\embarcadero\rad studio\7.0\include";"c:\program files\embarcadero\rad studio\7.0\RaveReports\Lib" -U"c:\program files\embarcadero\rad studio\7.0\lib";"C:\Documents and Settings\Administrator\My Documents\RAD Studio\7.0\Imports";"c:\program files\embarcadero\rad studio\7.0\Imports";"c:\program files\embarcadero\rad studio\7.0\Lib\Indy10";"C:\Documents and Settings\All Users\Documents\RAD Studio\7.0\Dcp";"c:\program files\embarcadero\rad studio\7.0\include";"c:\program files\embarcadero\rad studio\7.0\RaveReports\Lib" -K00400000 -NO"C:\Documents and Settings\All Users\Documents\RAD Studio\7.0\Dcp" Project1.dpr C:\Documents and Settings\Administrator\桌面\Unit2.pas(31,3): error E2003: E2003 Undeclared identifier: 'MemShowInfo' C:\Documents and Settings\Administrator\桌面\Unit2.pas(31,15): error E2066: E2066 Missing operator or semicolon C:\Documents and Settings\Administrator\桌面\Unit2.pas(33,24): error E2003: E2003 Undeclared identifier: 'formInfoInput' C:\Documents and Settings\Administrator\桌面\Unit2.pas(33,38): warning W1058: W1058 Implicit string cast with potential data loss from 'string' to 'ShortString' C:\Documents and Settings\Administrator\桌面\Unit2.pas(33,38): error E2066: E2066 Missing operator or semicolon C:\Documents and Settings\Administrator\桌面\Unit2.pas(35,48): warning W1058: W1058 Implicit string cast with potential data loss from 'string' to 'ShortString' C:\Documents and Settings\Administrator\桌面\Unit2.pas(35,48): error E2066: E2066 Missing operator or semicolon C:\Documents and Settings\Administrator\桌面\Unit2.pas(35,67): error E2014: E2014 Statement expected, but expression of type 'TCaption' found C:\Documents and Settings\Administrator\桌面\Unit2.pas(36,48): warning W1058: W1058 Implicit string cast with potential data loss from 'string' to 'ShortString' C:\Documents and Settings\Administrator\桌面\Unit2.pas(36,48): error E2066: E2066 Missing operator or semicolon C:\Documents and Settings\Administrator\桌面\Unit2.pas(36,68): error E2014: E2014 Statement expected, but expression of type 'TCaption' found C:\Documents and Settings\Administrator\桌面\Unit2.pas(37,48): warning W1058: W1058 Implicit string cast with potential data loss from 'string' to 'ShortString' C:\Documents and Settings\Administrator\桌面\Unit2.pas(37,48): error E2066: E2066 Missing operator or semicolon C:\Documents and Settings\Administrator\桌面\Unit2.pas(37,69): error E2014: E2014 Statement expected, but expression of type 'TCaption' found C:\Documents and Settings\Administrator\桌面\Unit2.pas(38,48): warning W1058: W1058 Implicit string cast with potential data loss from 'string' to 'ShortString' C:\Documents and Settings\Administrator\桌面\Unit2.pas(38,48): error E2066: E2066 Missing operator or semicolon C:\Documents and Settings\Administrator\桌面\Unit2.pas(38,69): error E2014: E2014 Statement expected, but expression of type 'TCaption' found C:\Documents and Settings\Administrator\桌面\Unit2.pas(39,48): warning W1058: W1058 Implicit string cast with potential data loss from 'string' to 'ShortString' C:\Documents and Settings\Administrator\桌面\Unit2.pas(39,48): error E2066: E2066 Missing operator or semicolon C:\Documents and Settings\Administrator\桌面\Unit2.pas(39,60): error E2066: E2066 Missing operator or semicolon C:\Documents and Settings\Administrator\桌面\Unit2.pas(39,72): error E2014: E2014 Statement expected, but expression of type 'TCaption' found C:\Documents and Settings\Administrator\桌面\Unit2.pas(40,15): error E2066: E2066 Missing operator or semicolon C:\Documents and Settings\Administrator\桌面\Unit2.pas(42,25): error E2003: E2003 Undeclared identifier: 'btnQuitClick' C:\Documents and Settings\Administrator\桌面\Unit2.pas(42,37): error E2029: E2029 ';' expected but '(' found C:\Documents and Settings\Administrator\桌面\Unit1.pas(39): error F2063: F2063 Could not compile used unit '..\..\..\桌面\Unit2.pas' Done building target "CoreCompile" in project "Project1.dproj" -- FAILED. Done building project "Project1.dproj" -- FAILED. Build FAILED. C:\Documents and Settings\Administrator\桌面\Unit2.pas(33,38): warning W1058: W1058 Implicit string cast with potential data loss from 'string' to 'ShortString' C:\Documents and Settings\Administrator\桌面\Unit2.pas(35,48): warning W1058: W1058 Implicit string cast with potential data loss from 'string' to 'ShortString' C:\Documents and Settings\Administrator\桌面\Unit2.pas(36,48): warning W1058: W1058 Implicit string cast with potential data loss from 'string' to 'ShortString' C:\Documents and Settings\Administrator\桌面\Unit2.pas(37,48): warning W1058: W1058 Implicit string cast with potential data loss from 'string' to 'ShortString' C:\Documents and Settings\Administrator\桌面\Unit2.pas(38,48): warning W1058: W1058 Implicit string cast with potential data loss from 'string' to 'ShortString' C:\Documents and Settings\Administrator\桌面\Unit2.pas(39,48): warning W1058: W1058 Implicit string cast with potential data loss from 'string' to 'ShortString' C:\Documents and Settings\Administrator\桌面\Unit2.pas(31,3): error E2003: E2003 Undeclared identifier: 'MemShowInfo' C:\Documents and Settings\Administrator\桌面\Unit2.pas(31,15): error E2066: E2066 Missing operator or semicolon C:\Documents and Settings\Administrator\桌面\Unit2.pas(33,24): error E2003: E2003 Undeclared identifier: 'formInfoInput' C:\Documents and Settings\Administrator\桌面\Unit2.pas(33,38): error E2066: E2066 Missing operator or semicolon C:\Documents and Settings\Administrator\桌面\Unit2.pas(35,48): error E2066: E2066 Missing operator or semicolon C:\Documents and Settings\Administrator\桌面\Unit2.pas(35,67): error E2014: E2014 Statement expected, but expression of type 'TCaption' found C:\Documents and Settings\Administrator\桌面\Unit2.pas(36,48): error E2066: E2066 Missing operator or semicolon C:\Documents and Settings\Administrator\桌面\Unit2.pas(36,68): error E2014: E2014 Statement expected, but expression of type 'TCaption' found C:\Documents and Settings\Administrator\桌面\Unit2.pas(37,48): error E2066: E2066 Missing operator or semicolon C:\Documents and Settings\Administrator\桌面\Unit2.pas(37,69): error E2014: E2014 Statement expected, but expression of type 'TCaption' found C:\Documents and Settings\Administrator\桌面\Unit2.pas(38,48): error E2066: E2066 Missing operator or semicolon C:\Documents and Settings\Administrator\桌面\Unit2.pas(38,69): error E2014: E2014 Statement expected, but expression of type 'TCaption' found C:\Documents and Settings\Administrator\桌面\Unit2.pas(39,48): error E2066: E2066 Missing operator or semicolon C:\Documents and Settings\Administrator\桌面\Unit2.pas(39,60): error E2066: E2066 Missing operator or semicolon C:\Documents and Settings\Administrator\桌面\Unit2.pas(39,72): error E2014: E2014 Statement expected, but expression of type 'TCaption' found C:\Documents and Settings\Administrator\桌面\Unit2.pas(40,15): error E2066: E2066 Missing operator or semicolon C:\Documents and Settings\Administrator\桌面\Unit2.pas(42,25): error E2003: E2003 Undeclared identifier: 'btnQuitClick' C:\Documents and Settings\Administrator\桌面\Unit2.pas(42,37): error E2029: E2029 ';' expected but '(' found C:\Documents and Settings\Administrator\桌面\Unit1.pas(39): error F2063: F2063 Could not compile used unit '..\..\..\桌面\Unit2.pas' 6 Warning(s) 19 Error(s) Time Elapsed 00:00:00.37 |
» 猜你喜欢
售SCI一区T0P文章,我:8.O.55.1.O.5.4,科目全,可+急
已经有7人回复
售一区SCI文章T0P,我:8O.551.O54,科目全,可十急
已经有6人回复
售SCI一区T0P文章,我:8.O55.1.O.54,科目全,可十急
已经有6人回复
售SCI一区文章,我:8O5.5.1.O5.4,科目全,可伽急
已经有7人回复
售SCI一区T0P文章,我:8.O55.1.O.54,科目全,可十急
已经有5人回复
售SCI文章,我:8O.5.5.1O.54,科目全,可十急
已经有5人回复
售SCI一区T0P文章,我:8O.55.1.O.5.4,科目齐全,可+急
已经有6人回复
售SCI一区T0P文章,我:8O.55.1.O.54,科目全,可伽急
已经有4人回复
售SCI一区T0P文章,我:8.O.55.1.O54,科目全,可伽急
已经有7人回复
售SCI文章,我:8O5.5.1.O.54,科目齐全,可+急
已经有6人回复
» 本主题相关价值贴推荐,对您同样有帮助:
MC一个简单的程序,运行不了,哪位大侠帮看看怎么回事。多谢!
已经有7人回复
运行结果为0,怎么回事?
已经有5人回复
运行一个python程序,出现问题,请高手赐教
已经有9人回复
同样的MATLAB程序,为何在别人的电脑上运行不了
已经有21人回复
用opengl做了个工程,编译无错误,但是运行不起来。。。
已经有11人回复
【转帖】delphi语法进阶
已经有3人回复
【转帖】用Delphi开发视频聊天软件
已经有8人回复
【求助】运行ms的时候跳出“由于另一个程序正在运行中,此操作无法完成。请选择切换…
已经有28人回复
【求助】此程序没有错误,怎么运行不出来?
已经有6人回复
【分享】一个Delphi的源码加密插件
已经有4人回复
【求助】为什么我编译了一个书本上的无错误的C++程序,却有这么多的错误?
已经有8人回复
【求助】此VB程序怎么运行不起来?
已经有8人回复
【求助】Fortran程序,如何让exe文件可以单独运行?
已经有6人回复
【求助】安装ansys时,运行Keygen程序,但不会自动生成一个文件License.dat,为什么?
已经有12人回复
» 抢金币啦!回帖就可以得到:
2026年人文教育与社会发展国际会议(HESD 2026)
+1/887
求助DL 5009.1-2014
规程 第1部分:火力发电》
+1/487
沈阳工业大学 环境电化学技术研究团队 招收硕士研究生(学硕/专硕)
+2/84
爱丁顿实验
+1/36
细胞检定样品,您用对了吗?
+1/3
委托检验的安全锁:质量保证协议,你签了吗?
+1/3
CAHSS(艺术、人文与社会科学国际会议)
+1/2
ICoEP(教育与心理学国际会议)
+1/2
ICoAAD(建筑、艺术与设计)
+1/2
GCHSD(全球文化遗产可持续发展大会)
+1/2
仪器验证全生命周期管理:检测数据精准与否的前提
+1/2
智能传感器网络实时数据处理:时序分析、DNN调度与MQTT边缘AI工作站配置
+1/1
清华大学-区域环境安全全国重点实验室招聘地下水科学/水文地质方向助理研究员/副研究�
+1/1
ICoFEE(林业、生态与环境)
+1/1
单细胞VDJ测序:从B细胞库中精准挖掘抗体药优势克隆
+1/1
CoIMCT(信息、媒体与通信技术)Informatics, Media and Communication Technology
+1/1
ECNLPIR(自然语言处理与信息检索)
+1/1
ECSFS(能源、气候与可持续发展峰会)
+1/1
CoEES(能源与地球科学)2027 International Conference on Energy and Earth Science
+1/1
新能源并网仿真:AI实现规程问答与试验报告生成,电磁暂态图形工作站硬件配置方案
+1/1
2楼2010-11-22 23:57:28
3楼2010-11-22 23:58:08
4楼2012-04-09 09:11:50
5楼2012-06-30 01:15:05
6楼2013-06-30 10:08:20










回复此楼
