| 查看: 2127 | 回复: 0 | ||
liyanliuheng金虫 (小有名气)
|
[求助]
CHEMKIN模型出错 REPEATED ERROR TEST FAILURES ON THE LAST STEP
|
|
CHEMKIN模型运行时出现以下错误,请教该如何解决 DASPK-- AT CURRENT T (=R1) 500 STEPS In above message, R1 = 0.8194061471290-157 DASPK-- TAKEN ON THIS CALL BEFORE REACHING TOUT A LOT OF WORK IN DDASPK, 500 MORE STEPS ALLOWED DASPK-- AT T (=R1) AND STEPSIZE H (=R2) THE In above, R1 = 0.2861457507093-156 R2 = 0.2044330383055-157 DASPK-- ERROR TEST FAILED REPEATEDLY OR WITH ABS(H)=HMIN TASK INTERRUPTED: TROUBLE IN THE TRANSIENT SOLVER DDASPK REPEATED ERROR TEST FAILURES ON THE LAST STEP |
» 猜你喜欢
现代”学阀”该如何界定
已经有14人回复
求合成方法
已经有8人回复
师弟论文见刊大半年才想起来申请专利,还能抢救一下吗?
已经有4人回复
上海工程技术大学 激光智能制造课题组 2027级博士研究生招生
已经有5人回复
课题组招2027级博士 上海工程技术大学 激光智能制造方向
已经有5人回复
有机合成以后会不会被AI改变?做科研的虫友怎么看
已经有8人回复
我的奶奶
已经有3人回复










回复此楼